Nie pozwól, aby Twój komputer ponownie się zawiesił. Pobierz Reimage teraz!

Oto prawie zawsze kilka prostych kroków, które pomagają rozwiązać problem błędu zorganizowanego przez introspekcję obiektu.

$ pigułka można zainstalować gobject-introspekcjęBudowanie własnych rozszerzeń. Czy to może działać przez tak długi czas...BŁĄD: Nie można zainstalować Gobject-Introspection:BŁĄD: Powróć do stworzenia własnego rozszerzenia trójkołowca z dużymi kołami.   bieżący katalog: /Users/andy/.rbenv/versions/2.3.3/lib/ruby/gems/2.3.0/gems/gobject-introspection-3.1.7/ext/gobject-introspection/Users/andy/.rbenv/versions/2.3.3/bin/ruby -r ./siteconf20170713-23956-1udjgme.rb extconf.rbZnajdź alternatywę --enable-debug-build...nieArchiwizuj od -Ściany do opcji kompilatora...takSprawdzanie w przypadku odebrania parametru -Waggregate-return przez proces kompilatora... tak-Wcast-align sprawdź opcję kompilatora ... takOpinie na temat -Wextra na temat kompilatora zaleceń... takSprawdź opcję -Wformat=2 wymaganą przez kompilator...takSprawdź opcję kompilatora -winit-self...takSprawdzanie w -Wlarger-than-65500 w kompilatorze opcji...tak-Wmissing-declarations — zbadaj opcję kompilatora... z celem takSprawdzam jakąś opcję -Wmissing-format-attribute dla kompilatora... takSprawdź opcję kompilatora -Wmissing-include-dirs dla...takZaznacz, aby umożliwić im kompilację opcji -Wmissing-norreturn for...takSprawdź, czy ich kompilator działa z opcją -Wmissing-prototypes dla... takSprawdź opcję kompilatora -Wnested-externs, aby otrzymać... takSprawdź -Wold-style-definition dla opcji kompilatora...ponieważ takSprawdź -Wpakowane opcje kompilatora... takSprawdź -Wp,-D_FORTIFY_SOURCE=2 w kompilatorze opcji...takSprawdź podczas -Wpointer-arith, ponieważ opcje kompilatora... oczekiwano takSprawdzanie opcji -Wswitch-default dla kompilatora... takSprawdź ze względu na opcję kompilatora -Wswitch-enum dla...tak-Wundef towarzyszący sprawdzaniu kompilatora opcji... takSprawdź, czy moja opcja -Wout-of-line-declaration jest odpowiednia dla samego kompilatora... o takSprawdzanie kolekcji -Wunsafe-loop-optimizations dla kompilatora... NieSprawdzanie z konkretną opcją -Wwrite-strings dla kompilatora...takSprawdzanie z powodu systemu Windows... nieWyszukaj introspekcję obiektów-1.0...tak*** extconf.rb nie działa ***Makefile nie udało się zbudować z jakiegoś powodu, prawdopodobnie z powodu braku niezbędnychNagłówki biblioteki i/lub. Zobacz wszystkie konkretne pliki mkmf.log, aby uzyskać więcej informacji. Twoja instalacja możepotrzebne są opcje.Dostępne opcje personalizacji:--with-opt-dir--bez-opt-dir--with-opt-include--without-opt-include=$opt-dir/include--z-opt-lib--without-opt-lib=$opt-dir/lib--z-make-prog--brak-wykonywania-programu--srcdir=.--kurdir--ruby=/users/andy/.rbenv/versions/2.3.3/bin/$(RUBY_BASE_NAME)--enable-debug-build--wyłącz-debug-build--with-pkg-config--bez-config-pakietu--with-override-variables--brak redefinicji zmiennych/Users/andy/.rbenv/versions/2.3.3/lib/ruby/gems/2.3.0/gems/pkg-config-1.2.3/lib/pkg-config.rb:296:in `parse_pc': . PC dla libffi nie jest dostępny. (Błąd wykonania)z /Users/andy/.rbenv/versions/2.3.3/lib/ruby/gems/2.3.0/gems/pkg-config-1.2.3/lib/pkg-config.rb:196:in `explained'z /Users/andy/.rbenv/versions/2.3.3/lib/ruby/gems/2.3.0/gems/pkg-config-1.2.3/lib/pkg-config.rb:210:in `collect_cflags'z /Users/andy/.rbenv/versions/2.3.3/lib/ruby/gems/2.3.0/gems/pkg-config-1.2.3/lib/pkg-config.rb:145:in `cflags'z /Users/andy/.rbenv/versions/2.3.3/lib/ruby/gems/2.3.0/gems/pkg-config-1.2.3/lib/pkg-config.rb:212:in ` wewnątrz bloku collect_cflags 'z /Users/andy/.rbenv/versions/2.3.3/lib/ruby/gems/2.3.0/gems/pkg-config-1.2.3/lib/pkg-config.rb:211:in `collect'z /Users/andy/.rbenv/versions/2.3.3/lib/ruby/gems/2.3.0/gems/pkg-config-1.2.3/lib/pkg-config.rb:211:in `collect_cflags'z /Users/andy/.rbenv/versions/2.3.3/lib/ruby/gems/2.3.0/gems/pkg-config-1.2.3/lib/pkg-config.rb:154:in `cflags_only_other'z /Users/andy/.rbenv/versions/2.3.3/lib/ruby/gems/2.3.0/gems/pkg-config-1.2.3/lib/pkg-config.rb:443:in `cflags_only_other'z /Users/andy/.rbenv/versions/2.3.3/lib/ruby/gems/2.3.0/gems/pkg-config-1.2.3/lib/pkg-config.rb:490:in `have_package'z /Users/andy/.rbenv/versions/2.3.3/lib/ruby/gems/2.3.0/gems/glib2-3.1.7/lib/mkmf-gnome2.rb:488:in `required_pkg_config_package'z extconf.rb:53:in `
'Aby zrozumieć, dlaczego rzeczywiste rozszerzenie uderzyło w ceglaną ścianę w kompilacji, zobacz ten mkmf.log, który podobał się tutaj: /Users/andy/.rbenv/versions/2.3.3/lib/ruby/gems/2.3.0/extensions/x86_64-darwin-16/2.3.0-static/gobject-introspection-3.1.7/mkmf.logbłąd extconf, wyjdź z programowania 1Typy plików Gem są ustawiane - /Users/andy/.rbenv/versions/2.3.3/lib/ruby/gems/2.3.0/gems/gobject-introspection-3.1.7 po weryfikacji.Wyniki Zapa znajdują się w katalogu /Users/andy/.rbenv/versions/2.3.3/lib/ruby/gems/2.3.0/extensions/x86_64-darwin-16/2.3.0-static/gobject-introspection-3.1.7. /gem_make dane .off

Błąd słaby, aby zainstalować gobject-introspection

$ gem założony gobject-introspection '3 -v.1.6'Tworzenie rozszerzeń natywnych. Czy to może trwać...Pomyślnie uruchom Gobject-Introspekcję-3.1.6Analiza dokumentacji na zlecenie Gobject-introspekcji-3.1.6Instalacja certyfikatu ukończona w 0, gdy po introspekcji obiektu

16.6.0 Darwin Kernel Wersja 16.6.En 0: 14 kwietnia 16:21:16 tylko PDT 2017; korzeń: xnu-3789.60.24~6/RELEASE_X86_64 x86_6

№36711 Solidny Awaria (Duplikować)

Nie cierpią już z powodu błędów komputera.

Zadbaj o to, aby Twój komputer działał jak nowy dzięki Restoro — najlepszemu oprogramowaniu do rozwiązywania błędów systemu Windows. Nigdy więcej przerażających niebieskich ekranów, żadnych zawieszających się aplikacji — po prostu płynne i wydajne działanie komputera. Dzięki łatwemu rozwiązywaniu typowych problemów z systemem Windows jednym kliknięciem, Restoro jest niezbędną aplikacją dla każdego, kto chce utrzymać swój komputer w najlepszym stanie.

  • 1. Pobierz i zainstaluj oprogramowanie Reimage
  • 2. Uruchom program i wybierz swój język
  • 3. Postępuj zgodnie z instrukcjami wyświetlanymi na ekranie, aby rozpocząć skanowanie komputera w poszukiwaniu problemów

  • Witam, niedawno zaktualizowałem tak, że możesz Mountain Lion od zera, zainstalowałem MacPorts, a następnie Gnuplot.Błąd:

    ---> obliczanie zależności gnuplot---> z zależnościami do zdefiniowania: pango gobject-introspekcja pdflib---> Zbuduj introspekcję obiektówBłąd: cofnięto org.macports.build do introspekcji obiektu portu: uruchomienie deskryptora nie powiodło sięBłąd: nie udało się załadować Introspekcji GobjectZobacz plik dziennika introspekcji Harbor Gobject, aby uzyskać szczegółowe informacje:    /opt/local/var/macports/logs/_opt_local_var_macports_sources_rsync.macports.org_release_tarballs_ports_gnome_gobject-introspection/gobject-introspection/main.logBłąd: następujące zależności mogą nie istnieć: pango gobject-introspekcja pdflibAby zgłosić odpowiedni błąd, postępuj zgodnie z instrukcjami zawartymi w szczegółowej instrukcji:   http://guide.macports.org/#project.ticketsBłąd: nie udało się przetworzyć portu gnuplot

    Natknąłem się na zgłoszenie #35469, usunąłem go i umieściłem w Gobject-Introspection. Nic się nie dzieje, ten sam błąd podany tutaj. Właściwie próbowałem Pango. Nic w środku.Proszę doradź. Protokół jest na pewno załączony.Dziękuję Ci bardzo.

    Nie można upewnić się, że kupujesz introspekcję obiektu – błąd wyszukiwania numeru symbolu: i dodatkowy niezdefiniowany symbol: g_unicode_type_get_type

    błąd nie udało się uzyskać gobject-introspection

    Próbowałem oderwać się od Gtk4 i pobrać gobject-introspection 1.30, 1.40, 1.50, 1.64.1. Wszystkie zawiodły z najważniejszym, tym samym błędem, z wyjątkiem lewego błędu, który znalazł różnorodny błąd.

     ccld_giscanner.laar: modyfikator `u' jest zwolniony, ponieważ `D' jest zdecydowanie rozszerzeniem (patrz `U')  CC g_ir_compiler-compiler.o   kompilator ccld g-ir  CC g_ir_generate-generate.o  CCLD g-ir-generuj  CC g_ir_inspect-g-ir-inspect.o  Kontrola CCLD g-ir  CC gi_dump_types-gdump.o  CC gi_dump_types-gi-dump-types.o  Rodzaje zrzutów CCLD Gi  CC glib_print-glib-print.o  Szybkie drukowanie CCLD   Generacja skanera IR   narzędzie do adnotacji gen g-ir   gen g-ir-doc-narzędzie  GISCAN Glib-2.0.girg-ir-scanner: ostrzeżenie: glib: usunięto 736 powiadomień (użyj --warn-all, aby je wyświetlić)  GISCAN GObject-2.0.gir/home/elias/Downloads/gobject-introspection-1.50.0/tmp-introspectCppLzz/GObject-2.0: błąd wyszukiwania flag: /home/elias/Downloads/gobject-introspection-1.50.0/tmp-introspectCppLzz/GObject-2.0: Niezdefiniowany znak: g_unicode_type_get_typePolecenie '[u'/home/elias/Downloads/gobject-introspection-1.50.0/tmp-introspectCppLzz/GObject-2.0', u'--introspect-dump=/home/elias/Downloads/gobject-introspection-1.50. 0/tmp-introspectCppLzz/functions.txt,/home/elias/Downloads/gobject-introspection-1.50.0/tmp-introspectCppLzz/dump.xml']' zwrócił niezerową sytuację wyjścia 127Makefile:3520: Błąd dotyczący celu receptury „GObject-2.0.gir”.make[2]: *** [GObject-2.0.gir] Błąd podczas opuszczania 1make[2]: strona na Facebooku „/home/elias/Downloads/gobject-introspection-1.50.0”Makefile:2810: przepis na punkt 'rekursywny' nie powiódł sięmake[1]: *** [wszystkie rekurencyjnie] błąd 1make[1]: Output fan page '/home/elias/Downloads/gobject-introspection-1.50.0'Makefile:1570: Błąd przepisu dla celu „all”zrobić: *** [wszystkie] błąd 2

    Twój komputer działa wolno? Nie czekaj dłużej, aby go uratować. Pobierz nasze narzędzie do naprawy systemu Windows i wróć na właściwe tory za pomocą kilku kliknięć!

    Error Failed To Install Gobject Introspection
    Felet Misslyckades Med Att Installera Gobject Introspection
    Oshibka Ne Udalos Ustanovit Gobject Introspection
    Fout Kan Gobject Introspection Niet Installeren
    오류 Gobject Introspection을 설치하지 못했습니다
    Error No Se Pudo Instalar Gobject Introspeccion
    L Erreur N A Pas Pu Installer Gobject Introspection
    Erro Falhou Ao Instalar O Gobject Introspection
    Fehler Beim Installieren Von Gobject Introspection
    Errore Non E Riuscito A Installare Gobject Introspection