No dejes que tu PC se bloquee de nuevo. ¡Descarga Reimage ahora!

Aquí hay algunos pasos simples que pueden ayudar a resolver el problema de error de instalación de gobject-introspection.

$ pill install gobject-introspecciónConstruyendo sus extensiones operativas. ¿Puede durar nuestro largo...ERROR: No se pudo instalar Gobject-Introspección:ERROR: Alternativa de crear su propia extensión de gema.   directorio actual: /Users/andy/.rbenv/versions/2.3.3/lib/ruby/gems/2.3.0/gems/gobject-introspection-3.1.7/ext/gobject-introspection/Usuarios/andy/.rbenv/versions/2.3.3/bin/ruby -r ./siteconf20170713-23956-1udjgme.rb extconf.rbEncuentra la opción --enable-debug-build...noArchivar desde -Wall a la opción del compilador... síComprobando si el compilador recibía a menudo el parámetro -Waggregate-return... sí-Opción del compilador de comprobación Wcast-align... síComentarios de -Wextra sobre el compilador de opciones... síMarque la opción más importante -Wformat=2 requerida por ese compilador... síCompruebe la opción del compilador -winit-self... síComprobando -Wlarger-than-65500 con respecto al compilador de opciones... sí- Oportunidad del compilador de verificación de declaraciones Wmissing... con destino síVerificando la opción sensata -Wmissing-format-attribute para el compilador... síCompruebe la solución del compilador -Wmissing-include-dirs para... síComprobar debido a la elección del compilador -Wmissing-norreturn para... síCompruebe si el compilador se puede usar con la opción -Wmissing-prototypes para... síCompruebe la opción del compilador -Wnested-externs para... síMarque -Wold-style-definition para la opción del compilador... porque síCompruebe las opciones del compilador -Wpacked... síCompruebe -Wp,-D_FORTIFY_SOURCE=2 en el compilador de recomendaciones... síComprobar durante -Wpointer-arith los productos del compilador... se esperaba que síMarcando la opción -Wswitch-default sobre el compilador... síComprobar debido con respecto a la opción del compilador -Wswitch-enum para... sí-Comprobación relacionada con Wundef destinada al compilador de opciones... síVerifique si la posibilidad de declaración -Wout-of-line es apropiada para el compilador ... sobre síMarcando la opción -Wunsafe-loop-optimizations para todo el compilador... NoVerificando con la opción sensata -Wwrite-strings para el compilador... síComprobando como más joven que Windows... noBuscar objeto-introspección-1.0... sí*** extconf.rb no se ejecuta ***Makefile no se pudo compilar por alguna razón, probablemente debido a la falta de uso necesarioEncabezados de biblioteca y/o. Consulte el archivo mkmf.log muy específico para obtener más detalles. Tu levantamiento puedese necesitan opciones.Opciones de personalización disponibles:--with-opt-dir--sin-opt-dir--con-optar-incluir--sin-opt-include=$opt-dir/include--con-opt-lib--sin-opt-lib=$opt-dir/lib--con-hacer-prog--no-ejecución-del-programa--srcdir=.--cuadernillo--ruby=/users/andy/.rbenv/versions/2.3.3/bin/$(RUBY_BASE_NAME)--habilitar-depurar-construir--deshabilitar-depurar-construir--with-pkg-config--sin-paquete de configuración--con-anular-variables--sin redefinición ajustable/Users/andy/.rbenv/versions/2.3.3/lib/ruby/gems/2.3.0/gems/pkg-config-1.2.3/lib/pkg-config.rb:296:in `parse_pc': . PC como libffi no está disponible. (Error de ejecución)de /Users/andy/.rbenv/versions/2.3.3/lib/ruby/gems/2.3.0/gems/pkg-config-1.2.3/lib/pkg-config.rb:196:in `explicado'de /Users/andy/.rbenv/versions/2.3.3/lib/ruby/gems/2.3.0/gems/pkg-config-1.2.3/lib/pkg-config.rb:210:in `collect_cflags'de /Users/andy/.rbenv/versions/2.3.3/lib/ruby/gems/2.3.0/gems/pkg-config-1.2.3/lib/pkg-config.rb:145:in `cflags'de /Users/andy/.rbenv/versions/2.3.3/lib/ruby/gems/2.3.0/gems/pkg-config-1.2.3/lib/pkg-config.rb:212:in bloque ` en collect_cflags 'de /Users/andy/.rbenv/versions/2.3.3/lib/ruby/gems/2.3.0/gems/pkg-config-1.2.3/lib/pkg-config.rb:211:in `collect'de /Users/andy/.rbenv/versions/2.3.3/lib/ruby/gems/2.3.0/gems/pkg-config-1.2.3/lib/pkg-config.rb:211:en `collect_cflags'de /Users/andy/.rbenv/versions/2.3.3/lib/ruby/gems/2.3.0/gems/pkg-config-1.2.3/lib/pkg-config.rb:154:en `cflags_only_other'de /Users/andy/.rbenv/versions/2.3.3/lib/ruby/gems/2.3.0/gems/pkg-config-1.2.3/lib/pkg-config.rb:443:en `cflags_only_other'de /Users/andy/.rbenv/versions/2.3.3/lib/ruby/gems/2.3.0/gems/pkg-config-1.2.3/lib/pkg-config.rb:490:in `have_package'de /Users/andy/.rbenv/versions/2.3.3/lib/ruby/gems/2.3.0/gems/glib2-3.1.7/lib/mkmf-gnome2.rb:488:en `required_pkg_config_package'desde extconf.rb:53:en `'Para comprender por qué la extensión rompe una pared de ladrillos durante la compilación, descubra este mkmf.log que se encuentra aquí:  /Users/andy/.rbenv/versions/2.3.3/lib/ruby/gems/2.3.0/extensions/x86_64-darwin-16/2.3.0-static/gobject-introspection-3.1.7/mkmf.logerror extconf, código de salida 1Los tipos y diseños de archivos de gemas se establecen en /Users/andy/.rbenv/versions/2.3.3/lib/ruby/gems/2.3.0/gems/gobject-introspection-3.1.7 inmediatamente después de la verificación.Los resultados de Zap están en /Users/andy/.rbenv/versions/2.3.3/lib/ruby/gems/2.3.0/extensions/x86_64-darwin-16/2.3.0-static/gobject-introspection-3.1.7. /gem_make leña .off

error al colocar en gobject-introspection

$ gem setup gobject-introspection '3 -v.1.6'Creación perteneciente a extensiones nativas. ¿Puede el pensamiento durar...Ejecute Gobject-Introspection-3.1.6 con éxitoAnálisis de documentación para gobject-introspection-3.1.6Aumento de la certificación completado en 0 segundos después de la introspección de gobject
16.6.0 Darwin Kernel Versión 16.6.En 0: 14 de abril 16:21:16 PDT 2017 solamente; básico: xnu-3789.60.24~6/RELEASE_X86_64 x86_6

№36711 Firma Mal funcionamiento (Duplicar)

No sufra más errores de PC.

Mantenga su PC funcionando como nueva con Restoro, el último software de resolución de errores de Windows. No más pantallas azules temidas, no más aplicaciones bloqueadas, solo una experiencia de PC fluida y eficiente. Con una resolución fácil con un solo clic de los problemas comunes de Windows, Restoro es la aplicación imprescindible para cualquier persona que quiera mantener su computadora en óptimas condiciones.

  • 1. Descargue e instale el software Reimage
  • 2. Inicie el programa y seleccione su idioma
  • 3. Siga las instrucciones en pantalla para iniciar un análisis de su computadora en busca de problemas

  • Hola, recientemente actualicé a Mountain Lion desde cero, instalé MacPorts y Gnuplot.Error:

    ---> cálculo de dependencia de gnuplot---> que tiene dependencias a definir: pango gobject-introspection pdflib---> Construir introspección de objetosError: devolvió org.macports.build del objeto de puerto de introspección: la ejecución del descriptor fallóError: no se pudo cargar la introspección de GobjectConsulte el archivo de registro de introspección de Harbor Gobject para obtener más información:    /opt/local/var/macports/logs/_opt_local_var_macports_sources_rsync.macports.org_release_tarballs_ports_gnome_gobject-introspection/gobject-introspection/main.logError: es posible que las dependencias de observación no estén instaladas: pango gobject-introspection pdflibPara reportar el error enfocado, siga las instrucciones en el manual indicado:   http://guide.macports.org/#project.ticketsError: no se pudo procesar el puerto gnuplot

    Encontré las infracciones #35469, las eliminé e instalé Gobject-Introspection. No pasa nada, mismo error anterior. De hecho, probé Pango. Nada en absoluto.Urge por favor. Se adjunta protocolo.Muchas gracias relativamente.

    No se puede comprar la introspección del modelo: error de búsqueda de símbolo: y, por lo tanto, símbolo adicional no definido: g_unicode_type_get_type

    Error al instalar gobject-introspection

    Traté de abstraerme de Gtk4 y además descargué gobject-introspection 1.30, 1.40, 1.50, 1.64.1. Todos fallaron con el error genuino, excepto el error restante que encontró un error diferente.

     ccld_giscanner.laar: el modificador 'u' se ignora solo porque 'D' es definitivamente el predeterminado (ver 'U')  CC g_ir_compiler-compiler.o   compilador g-ir ccld  CC g_ir_generar-generar.o  CCLD g-ir-generar  CC g_ir_inspect-g-ir-inspect.o  Inspección CCLD g-ir  CC gi_dump_types-gdump.o  CC gi_dump_types-gi-dump-types.o  Tipos de todos los volcados CCLD Gi  CC glib_print-glib-print.o  Impresión CCLD rápida   Generación de escáner IR   herramienta de anotación g-ir de grupo de edad   generación g-ir-doc-herramienta  GISCAN GLib-2.0.girg-ir-scanner: advertencia: glib: expulsado 736 advertencias (use --warn-all para que las presente)  GISCAN GObject-2.0.gir/home/elias/Downloads/gobject-introspection-1.50.0/tmp-introspectCppLzz/GObject-2.0: error de búsqueda de agujeros: /home/elias/Downloads/gobject-introspection-1.50.0/tmp-introspectCppLzz/GObject-2.0: Carácter no definido: g_unicode_type_get_typeComando '[u'/home/elias/Downloads/gobject-introspection-1.50.0/tmp-introspectCppLzz/GObject-2.0', u'--introspect-dump=/home/elias/Downloads/gobject-introspection-1.50. 0/tmp-introspectCppLzz/functions.txt,/home/elias/Downloads/gobject-introspection-1.50.0/tmp-introspectCppLzz/dump.xml']' devolvió que simplemente no tiene una situación de salida nula 127Makefile:3520: Error para el objetivo de la estrategia "GObject-2.0.gir".make[2]: *** [GObject-2.0.gir] Error al salir de 1make[2]: página del directorio '/home/elias/Downloads/gobject-introspection-1.50.0'Makefile: 2810: el menú de puntos 'recursivo' fallómake[1]: *** [todo recursivamente] error 1make[1]: Página de salida '/home/elias/Downloads/gobject-introspection-1.50.0'Makefile: 1570: error de receta para el objetivo "todos"hacer: *** [todos] error 2

    ¿Tu computadora va lenta? No esperes más para rescatarlo. ¡Descarga nuestra herramienta de reparación de Windows y vuelve a la normalidad con unos pocos clics!

    Error Failed To Install Gobject Introspection
    Felet Misslyckades Med Att Installera Gobject Introspection
    Blad Nie Powiodl Sie Podczas Instalacji Introspekcji Gobject
    Oshibka Ne Udalos Ustanovit Gobject Introspection
    Fout Kan Gobject Introspection Niet Installeren
    오류 Gobject Introspection을 설치하지 못했습니다
    L Erreur N A Pas Pu Installer Gobject Introspection
    Erro Falhou Ao Instalar O Gobject Introspection
    Fehler Beim Installieren Von Gobject Introspection
    Errore Non E Riuscito A Installare Gobject Introspection