Lassen Sie Ihren PC nicht wieder abstürzen. Jetzt Reimage herunterladen!

Hier sind ein paar absolut einfache Schritte, die das Problem der fehlerhaften Berechnung bei der Gobject-Introspection-Installation lösen können.

$ pille installieren gobject-introspectionAufbau dieser eigenen Erweiterungen. Kann es so erstaunlich lange dauern ...FEHLER: Gobject-Introspection konnte nicht installiert werden:BUG: Fallback zum Erstellen Ihrer eigenen Juwelenerweiterung.   aktuelles Verzeichnis: /Users/andy/.rbenv/versions/2.3.3/lib/ruby/gems/2.3.0/gems/gobject-introspection-3.1.7/ext/gobject-introspection/Users/andy/.rbenv/versions/2.3.3/bin/ruby -s ./siteconf20170713-23956-1udjgme.rb extconf.rbSuchen Sie die Option --enable-debug-build...noArchiv verursacht durch -Wall zur Compiler-Option ... jaPrüfen, ob ich sagen würde, dass der Parameter -Waggregate-return von unserem eigenen Compiler empfangen wurde ... ja-Wcast-align Check-Compiler-Option ... jaFeedback von -Wextra über den Options-Compiler ... jaÜberprüfen Sie alle Optionen -Wformat=2, die von seinem Compiler benötigt werden ... jaÜberprüfen Sie die Compiler-Option -winit-self...yesSuche nach -Wlarger-than-65500 im Optionscompiler ... ja-Wmissing-declarations bewerte Compiler-Option ... mit Ziel jaÜberprüfen der Option -Wmissing-format-attribute für den Compiler ... jaÜberprüfen Sie die Compiler-Entscheidung -Wmissing-include-dirs for...yesÜberprüfen Sie aufgrund der tatsächlichen Compiler-Option -Wmissing-norreturn auf ... jaÜberprüfen Sie, ob Sie sehen, dass der Compiler mit der Option -Wmissing-prototypes funktioniert, die für ... geeignet istÜberprüfen Sie die Compiler-Option -Wnested-externs für ... jaÜberprüfen Sie -Wold-style-definition auf Compiler-Option ... weil jaÜberprüfen Sie die Compiler-Optionen von -Wpacked ... jaÜberprüfen Sie -Wp,-D_FORTIFY_SOURCE=2 zurück Optionen Compiler ... jaPrüfen Sie während -Wpointer-arith in Bezug auf Compiler-Optionen ... erwartet jaÜberprüfung der persönlichen Voreinstellung -Wswitch-default für den Compiler ... jaÜberprüfen Sie aufgrund der endgültigen Compiler-Option -Wswitch-enum auf ... ja-Wundef-bezogene Bestätigung für Options-Compiler ... jaÜberprüfen Sie, ob die Option -Wout-of-line-declaration für den genauen Compiler geeignet ist ... ungefähr jaÜberprüfen Sie die Option -Wunsafe-loop-optimizations, damit der Compiler ... NeinÜberprüfung mit der Option -Wwrite-strings für den Compiler ... jaAls weniger Windows prüfen ... neinSuchobjekt-Introspektion-1.0 ... ja*** extconf.rb versucht es nicht ***Makefile konnte aus mehreren Gründen nicht erstellt werden, wahrscheinlich aufgrund fehlender VerwendungBibliothekskopfzeilen und/oder. Weitere Einzelheiten finden Sie in der genauen mkmf.log-Datei. Ihre Installation kannOptionen sind erforderlich.Verfügbare Personalisierungsoptionen:--with-opt-dir--ohne-opt-dir--with-opt-include--without-opt-include=$opt-dir/include--with-opt-lib--without-opt-lib=$opt-dir/lib--with-make-prog--keine-Ausführung-des-Programms--srcdir=.--curdir--ruby=/users/andy/.rbenv/versions/2.3.3/bin/$(RUBY_BASE_NAME)--enable-debug-build--disable-debug-build--with-pkg-config--ohne-Konfigurationspaket--mit-Override-Variablen--keine Neudefinition von Variablen/Users/andy/.rbenv/versions/2.3.3/lib/ruby/gems/2.3.0/gems/pkg-config-1.2.3/lib/pkg-config.rb:296:in `parse_pc': . PC mit Unterstützung für libffi ist nicht verfügbar. (Ausführungsfehler)aus /Users/andy/.rbenv/versions/2.3.3/lib/ruby/gems/2.3.0/gems/pkg-config-1.2.3/lib/pkg-config.rb:196:in „erklärt“aus /Users/andy/.rbenv/versions/2.3.3/lib/ruby/gems/2.3.0/gems/pkg-config-1.2.3/lib/pkg-config.rb:210:in `collect_cflags'aus /Users/andy/.rbenv/versions/2.3.3/lib/ruby/gems/2.3.0/gems/pkg-config-1.2.3/lib/pkg-config.rb:145:in `cflags'aus /Users/andy/.rbenv/versions/2.3.3/lib/ruby/gems/2.3.0/gems/pkg-config-1.2.3/lib/pkg-config.rb:212:in ` Block in collect_cflags 'aus /Users/andy/.rbenv/versions/2.3.3/lib/ruby/gems/2.3.0/gems/pkg-config-1.2.3/lib/pkg-config.rb:211:in `collect'aus /Users/andy/.rbenv/versions/2.3.3/lib/ruby/gems/2.3.0/gems/pkg-config-1.2.3/lib/pkg-config.rb:211:in `collect_cflags'aus /Users/andy/.rbenv/versions/2.3.3/lib/ruby/gems/2.3.0/gems/pkg-config-1.2.3/lib/pkg-config.rb:154:in `cflags_only_other'aus /Users/andy/.rbenv/versions/2.3.3/lib/ruby/gems/2.3.0/gems/pkg-config-1.2.3/lib/pkg-config.rb:443:in `cflags_only_other'aus /Users/andy/.rbenv/versions/2.3.3/lib/ruby/gems/2.3.0/gems/pkg-config-1.2.3/lib/pkg-config.rb:490:in `have_package'aus /Users/andy/.rbenv/versions/2.3.3/lib/ruby/gems/2.3.0/gems/glib2-3.1.7/lib/mkmf-gnome2.rb:488:in `required_pkg_config_package'aus extconf.rb:53:in `
'Um zu verstehen, warum das Wachstum während des Systems auf eine Mauer traf, sehen Sie sich dieses mkmf.log an, das Sie hier finden: /Users/andy/.rbenv/versions/2.3.3/lib/ruby/gems/2.3.0/extensions/x86_64-darwin-16/2.3.0-static/gobject-introspection-3.1.7/mkmf.logextconf-Fehler, Exit-Code 1Gem-Datentypen werden bei der nächsten Überprüfung auf /Users/andy/.rbenv/versions/2.3.3/lib/ruby/gems/2.3.0/gems/gobject-introspection-3.1.7 gesetzt.Zap-Ergebnisse befinden sich in /Users/andy/.rbenv/versions/2.3.3/lib/ruby/gems/2.3.0/extensions/x86_64-darwin-16/2.3.0-static/gobject-introspection-3.1.7. /gem_make zeichnet .off auf

Fehler bei der Installation von gobject-introspection

$ gem setup gobject-introspection '3 -v.1.6'Erstellung von nativen Erweiterungen. Kann diese Aufgabe dauern ...Führen Sie Gobject-Introspection-3.1.6 erfolgreich ausDokumentationsanalyse, um Goobject-Introspection-3.1.6 zu habenZertifizierungsinstallation in 0 Sekunden nach Gobject-Introspection abgeschlossen
16.6.0 Darwin Kernel Version 16.6.En 1: 14. April 16:21:16 PDT 2017 nur; root: xnu-3789.60.24~6/RELEASE_X86_64 x86_6

№36711 Feste Fehlfunktion (Duplikat)

Leiden Sie nicht länger unter PC-Fehlern.

Lassen Sie Ihren PC mit Restoro, der ultimativen Windows-Fehlerbehebungssoftware, wie neu laufen. Keine gefürchteten Blue Screens mehr, keine abstürzenden Anwendungen mehr – nur ein reibungsloses, effizientes PC-Erlebnis. Mit der einfachen Ein-Klick-Lösung gängiger Windows-Probleme ist Restoro die unverzichtbare Anwendung für jeden, der seinen Computer in Top-Zustand halten möchte.

  • 1. Laden Sie die Reimage-Software herunter und installieren Sie sie
  • 2. Starten Sie das Programm und wählen Sie Ihre Sprache aus
  • 3. Befolgen Sie die Anweisungen auf dem Bildschirm, um einen Scan Ihres Computers nach Problemen zu starten

  • Hallo, ich habe kürzlich von Grund auf auf Mountain Lion aktualisiert, MacPorts installiert und auch Gnuplot.Fehler:

    ---> Gnuplot-Abhängigkeitsberechnung---> ausgestattet mit Abhängigkeiten zur Definition: pango gobject-introspection pdflib---> Objekt-Introspektion aufbauenFehler: org.macports.build zurückgegeben, um das Port-Objekt endgültig zu überprüfen: Deskriptorleistung fehlgeschlagenFehler: Gobject Introspection konnte nicht geladen werdenDetails finden Sie in der Introspection-Protokolldatei von Harbor Gobject:    /opt/local/var/macports/logs/_opt_local_var_macports_sources_rsync.macports.org_release_tarballs_ports_gnome_gobject-introspection/gobject-introspection/main.logFehler: Die After-Abhängigkeiten sind möglicherweise nicht installiert: pango gobject-introspection pdflibUm den passenden Fehler zu melden, befolgen Sie die Anweisungen im gesamten ausführlichen Handbuch:   http://guide.macports.org/#project.ticketsFehler: Gnuplot-Port konnte nicht verarbeitet werden

    Ich habe den Preis #35469 gefunden, gelöscht und Gobject-Introspection installiert. Nichts passiert, gleicher Fehler oben. Eigentlich habe ich Pango ausprobiert. Nichts zusammen mit allem.Bitte beraten. Das Protokoll ist beigefügt.Vielen Dank Besitzern.

    Splashout bei Objekt-Introspektion nicht möglich – Fehler beim Erkunden des Symbols: und zusätzliches undefiniertes Symbol: g_unicode_type_get_type

    error failed to add gobject-introspection

    Ich habe versucht, von Gtk4 wegzukommen und gobject-introspection 1.30, 1.40, 1.50, 1.64.1 herunterzuladen. Alle sind mit dem tatsächlichen Fehler fehlgeschlagen, mit Ausnahme des Arbeitsfehlers, der einen anderen Fehler gefunden hat.

     ccld_giscanner.laar: `u'-Modifikator wird hauptsächlich ignoriert, weil `D' definitiv der Fall hinten ist (siehe `U')  CC g_ir_compiler-compiler.o   g-ir-ccld-Compiler  CC g_ir_generate-generate.o  CCLD g-ir-generieren  CC g_ir_inspect-g-ir-inspect.o  CCLD g-ir-Inspektion  CC gi_dump_types-gdump.o  CC gi_dump_types-gi-dump-types.o  Arten von CCLD-Gi-Dumps  CC glib_print-glib-print.o  Schneller CCLD-Druck   IR-Scanner-Generation   G-IR-Anmerkungstool zur Generierung   era g-ir-doc-tool  GISCAN GLib-2.0.girg-ir-scanner: Warnung: glib: 736-Warnungen entfernt (verwenden Sie --warn-all, damit sie angezeigt werden können)  GISCAN GObject-2.0.gir/home/elias/Downloads/gobject-introspection-1.50.0/tmp-introspectCppLzz/GObject-2.0: Suchfehler kennzeichnen: /home/elias/Downloads/gobject-introspection-1.50.0/tmp-introspectCppLzz/GObject-2.0: Undefinierte Zeichen: g_unicode_type_get_typeBefehl '[u'/home/elias/Downloads/gobject-introspection-1.50.0/tmp-introspectCppLzz/GObject-2.0', u'--introspect-dump=/home/elias/Downloads/gobject-introspection-1.50. 0/tmp-introspectCppLzz/functions.txt,/home/elias/Downloads/gobject-introspection-1.50.0/tmp-introspectCppLzz/dump.xml']' gab eine Exit-Situation 127 ungleich Null zurückMakefile:3520: Fehler wegen Rezeptziel "GObject-2.0.gir".make[2]: *** [GObject-2.0.gir] Fehler und gibt stattdessen 1 ausmake[2]: Verzeichnisseite '/home/elias/Downloads/gobject-introspection-1.50.0'Makefile:2810: Vorteilsrezept „rekursiv“ fehlgeschlagenmake[1]: *** [alle rekursiv] Fehlkalkulation 1make[1]: Ausgabeseite '/home/elias/Downloads/gobject-introspection-1.50.0'Makefile:1570: Rezeptfehler für Target „all“tun: *** [alle] Fehler 2

    Ihr Computer läuft langsam? Warten Sie nicht länger, um es zu retten. Laden Sie unser Windows-Reparaturtool herunter und machen Sie sich mit wenigen Klicks wieder auf den Weg!

    Error Failed To Install Gobject Introspection
    Felet Misslyckades Med Att Installera Gobject Introspection
    Blad Nie Powiodl Sie Podczas Instalacji Introspekcji Gobject
    Oshibka Ne Udalos Ustanovit Gobject Introspection
    Fout Kan Gobject Introspection Niet Installeren
    오류 Gobject Introspection을 설치하지 못했습니다
    Error No Se Pudo Instalar Gobject Introspeccion
    L Erreur N A Pas Pu Installer Gobject Introspection
    Erro Falhou Ao Instalar O Gobject Introspection
    Errore Non E Riuscito A Installare Gobject Introspection